Target
Fatty acid-binding protein 5
Ligand
BDBM312347
Substrate
Meas. Tech.
Time Resolved-Fluorescence Energy Transfer (TR-FRET) Assay
IC50
10.00±n/a nM
Citation
 Buettelmann, BCeccarelli, SMKuehne, HKuhn, BNeidhart, WObst Sander, URichter, H Bicyclic thiophenylamide compounds US Patent  US9604977 Publication Date 3/28/2017 
Target
Name:
Fatty acid-binding protein 5
Synonyms:
FABP5 Fatty acid binding protein epidermal | Fatty acid-binding protein 5 (FABP5)
Type:
Enzyme
Mol. Mass.:
15164.79
Organism:
Homo sapiens (Human)
Description:
Q01469
Residue:
135
  
Inhibitor
Name:
BDBM312347
Synonyms:
3-[3-(3-Cyclopropyl-[1,2,4]oxadiazol-5-yl)-6-methyl-4,5,6,7-tetrahydro-benzo[b]thiophen-2-ylcarbamoyl]-bicyclo[2.2.2]oct-2-ene-2-carboxylic acid | US9604977, Example 93
Type:
Small organic molecule
Emp. Form.:
C24H27N3O4S
Mol. Mass.:
453.554
SMILES:
CC1CCc2c(C1)sc(NC(=O)C1=C(C3CCC1CC3)C(O)=O)c2-c1nc(no1)C1CC1
: