Target
Fatty acid-binding protein 5
Ligand
BDBM312447
Substrate
Meas. Tech.
Time Resolved-Fluorescence Energy Transfer (TR-FRET) Assay
IC50
10.00±n/a nM
Citation
 Buettelmann, BCeccarelli, SMKuehne, HKuhn, BNeidhart, WObst Sander, URichter, H Bicyclic thiophenylamide compounds US Patent  US9604977 Publication Date 3/28/2017 
Target
Name:
Fatty acid-binding protein 5
Synonyms:
FABP5 Fatty acid binding protein epidermal | Fatty acid-binding protein 5 (FABP5)
Type:
Enzyme
Mol. Mass.:
15164.79
Organism:
Homo sapiens (Human)
Description:
Q01469
Residue:
135
  
Inhibitor
Name:
BDBM312447
Synonyms:
2-[6-Ethyl-3-(4-methyl-thiazol-2-yl)-4,5,6,7-tetrahydro-benzo[b]thiophen-2-ylcarbamoyl]-cyclohex-1-enecarboxylic acid | US9604977, Example 193
Type:
Small organic molecule
Emp. Form.:
C22H26N2O3S2
Mol. Mass.:
430.583
SMILES:
CCC1CCc2c(C1)sc(NC(=O)C1=C(CCCC1)C(O)=O)c2-c1nc(C)cs1
: