Target
Prostaglandin E2 receptor EP2 subtype
Ligand
BDBM179994
Substrate
Meas. Tech.
Binding Assay
pH
6±n/a
Ki
0.75±n/a nM
Comments
extracted
Citation
 Shibakawa, NYoneda, KKatsube, TKanda, TIto, KYamamoto, KIwase, NUshiyama, S Substituted biaryl compound US Patent  US9676720 Publication Date 6/13/2017 
Target
Name:
Prostaglandin E2 receptor EP2 subtype
Synonyms:
PE2R2_HUMAN PTGER2 Prostaglandin E2 receptor Prostanoid EP2 Receptor
Type:
Enzyme
Mol. Mass.:
39775.71
Organism:
Homo sapiens (Human)
Description:
P43116
Residue:
358
  
Inhibitor
Name:
BDBM179994
Synonyms:
US9676720, Example 6
Type:
Small organic molecule
Emp. Form.:
C29H26N4O4S
Mol. Mass.:
526.606
SMILES:
CC#Cc1cccc(c1)-c1ccc(CN(Cc2cccc(NCC(O)=O)n2)S(=O)(=O)c2cccnc2)cc1
: