Target
P2X purinoceptor 7
Ligand
BDBM173308
Substrate
Meas. Tech.
Radioligand Binding Assay
Ki
79.4±n/a nM
Citation
 Alcazar Vaca, MJAndres Gil, JILetavic, MARudolph, DAShireman, BTStenne, BMZiff, JM P2X7 modulators US Patent  US9604982 Publication Date 3/28/2017 
Target
Name:
P2X purinoceptor 7
Synonyms:
ATP receptor P2RX7_HUMAN P2X purinoceptor 7 (P2X7) P2Z receptor | Purinergic receptor
Type:
Protein
Mol. Mass.:
68602.85
Organism:
Homo sapiens (Human)
Description:
Q99572
Residue:
595
  
Inhibitor
Name:
BDBM173308
Synonyms:
US10323032, Example 42 US9604982, Example 42
Type:
Small organic molecule
Emp. Form.:
C19H14ClF3N4O
Mol. Mass.:
406.789
SMILES:
FC(F)(F)c1cccc(C(=O)N2CCc3c(C2)ncnc3-c2ccc[nH]2)c1Cl
: