Target
Caspase-7
Ligand
BDBM10347
Substrate
Caspase Fluorogenic Substrate
Meas. Tech.
Caspase Inhibition Assay
IC50
22.7±n/a nM
Citation
 Chu, WZhang, JZeng, CRothfuss, JTu, ZChu, YReichert, DEWelch, MJMach, RH N-benzylisatin sulfonamide analogues as potent caspase-3 inhibitors: synthesis, in vitro activity, and molecular modeling studies. J Med Chem 48:7637-47 (2005)  
Target
Name:
Caspase-7
Synonyms:
Apoptotic protease Mch-3 CASP7 CMH-1 MCH3 | caspase 7, apoptosis-related cysteine peptidase
Type:
Enzyme
Mol. Mass.:
34273.91
Organism:
Homo sapiens (Human)
Description:
P55210
Residue:
303
  
Inhibitor
Name:
BDBM10347
Synonyms:
(S)-1-(6-Fluoropyridin-2-yl-methyl)-5-(2-phenoxymethyl-azetidine--1-sulfonyl)-1H-indole-2,3-dione Azetidine Isatin Analogue 18i
Type:
Small organic molecule
Emp. Form.:
C24H20FN3O5S
Mol. Mass.:
481.496
SMILES:
Fc1cccc(CN2C(=O)C(=O)c3cc(ccc23)S(=O)(=O)N2CC[C@H]2COc2ccccc2)n1
:
Substrate
Name:
Caspase Fluorogenic Substrate
Synonyms:
Ac-DEVD-AMC | Caspase Fluorogenic Substrate
Type:
Peptide
Mol. Mass.:
1461.77
Organism:
Description:
AMC=7-Amino-4-methylcoumarin
Residue:
16
ACASPGLVALASPAMC