Target
Leucine-rich repeat serine/threonine-protein kinase 2 [G2019S]
Ligand
BDBM162334
Substrate
Meas. Tech.
LRRK2 Kinase Assay
IC50
<500±n/a nM
Citation
 Krishna Reddy, YV Substituted 5-(pyrazin-2-yl)-1H-pyrazolo [3, 4-B] pyridine and pyrazolo [3, 4-B] pyridine derivatives as protein kinase inhibitors US Patent  US9669028 Publication Date 6/6/2017 
Target
Name:
Leucine-rich repeat serine/threonine-protein kinase 2 [G2019S]
Synonyms:
LRRK2 LRRK2_HUMAN Leucine-rich repeat serine/threonine-protein kinase 2 (LRRK2)(G2019S) PARK8
Type:
Mol. Mass.:
286143.23
Organism:
Homo sapiens (Human)
Description:
Q5S007(G2019S)
Residue:
2527
  
Inhibitor
Name:
BDBM162334
Synonyms:
US9669028, 90 5-(6-(indolin-1-yl)pyrazin-2-yl)-3-methyl-1H-pyrazolo[3,4-b]pyridine
Type:
Small organic molecule
Emp. Form.:
C19H16N6
Mol. Mass.:
328.3705
SMILES:
Cc1n[nH]c2ncc(cc12)-c1cncc(n1)N1CCc2ccccc12
: