Target
Caspase-3
Ligand
BDBM10554
Substrate
Caspase Fluorogenic Substrate
Meas. Tech.
Caspase Inhibition Assay
IC50
9±n/a nM
Citation
 Mellon, CAspiotis, RBlack, CWBayly, CIGrimm, ELGiroux, AHan, YIsabel, EMcKay, DJNicholson, DWRasper, DMRoy, STam, JThornberry, NAVaillancourt, JPXanthoudakis, SZamboni, R Lipophilic versus hydrogen-bonding effect in P3 on potency and selectivity of valine aspartyl ketones as caspase 3 inhibitors. Bioorg Med Chem Lett 15:3886-90 (2005)  
Target
Name:
Caspase-3
Synonyms:
Apopain CASP3 CPP-32 Caspase 3 Caspase-3 subunit p17 SCA-1 Yama protein | caspase-3 preproprotein
Type:
Hydrolase; heterotetramer of two heterodimers
Mol. Mass.:
31607.55
Organism:
Homo sapiens (Human)
Description:
Residue:
277
  
Inhibitor
Name:
BDBM10554
Synonyms:
(3S)-5-(benzylsulfanyl)-3-[(2S)-2-{1-[2-methoxy-5-(3-methyl-1,2,4-oxadiazol-5-yl)phenyl]acetamido}-3-methylbutanamido]-4-oxopentanoic acid | valine aspartyl ketone 33
Type:
Small organic molecule
Emp. Form.:
C29H34N4O7S
Mol. Mass.:
582.668
SMILES:
COc1ccc(cc1CC(=O)N[C@@H](C(C)C)C(=O)N[C@@H](CC(O)=O)C(=O)CSCc1ccccc1)-c1nc(C)no1
:
Substrate
Name:
Caspase Fluorogenic Substrate
Synonyms:
Ac-DEVD-AMC | Caspase Fluorogenic Substrate
Type:
Peptide
Mol. Mass.:
1461.77
Organism:
Description:
AMC=7-Amino-4-methylcoumarin
Residue:
16
ACASPGLVALASPAMC