Target
Caspase-7
Ligand
BDBM10535
Substrate
Caspase Fluorogenic Substrate
Meas. Tech.
Caspase Inhibition Assay
IC50
139±n/a nM
Citation
 Mellon, CAspiotis, RBlack, CWBayly, CIGrimm, ELGiroux, AHan, YIsabel, EMcKay, DJNicholson, DWRasper, DMRoy, STam, JThornberry, NAVaillancourt, JPXanthoudakis, SZamboni, R Lipophilic versus hydrogen-bonding effect in P3 on potency and selectivity of valine aspartyl ketones as caspase 3 inhibitors. Bioorg Med Chem Lett 15:3886-90 (2005)  
Target
Name:
Caspase-7
Synonyms:
Apoptotic protease Mch-3 CASP7 CMH-1 MCH3 | caspase 7, apoptosis-related cysteine peptidase
Type:
Enzyme
Mol. Mass.:
34273.91
Organism:
Homo sapiens (Human)
Description:
P55210
Residue:
303
  
Inhibitor
Name:
BDBM10535
Synonyms:
(3S)-5-(benzylsulfanyl)-3-[(2S)-2-[(2R)-2-(5-bromo-2-methoxyphenyl)pent-4-ynamido]-3-methylbutanamido]-4-oxopentanoic acid | valine aspartyl ketone 14
Type:
Small organic molecule
Emp. Form.:
C29H33BrN2O6S
Mol. Mass.:
617.551
SMILES:
COc1ccc(Br)cc1[C@@H](CC#C)C(=O)N[C@@H](C(C)C)C(=O)N[C@@H](CC(O)=O)C(=O)CSCc1ccccc1
:
Substrate
Name:
Caspase Fluorogenic Substrate
Synonyms:
Ac-DEVD-AMC | Caspase Fluorogenic Substrate
Type:
Peptide
Mol. Mass.:
1461.77
Organism:
Description:
AMC=7-Amino-4-methylcoumarin
Residue:
16
ACASPGLVALASPAMC