Target
Caspase-8
Ligand
BDBM10556
Substrate
Caspase-8 Fluorogenic Substrate
Meas. Tech.
Caspase Inhibition Assay
IC50
98±n/a nM
Citation
 Mellon, CAspiotis, RBlack, CWBayly, CIGrimm, ELGiroux, AHan, YIsabel, EMcKay, DJNicholson, DWRasper, DMRoy, STam, JThornberry, NAVaillancourt, JPXanthoudakis, SZamboni, R Lipophilic versus hydrogen-bonding effect in P3 on potency and selectivity of valine aspartyl ketones as caspase 3 inhibitors. Bioorg Med Chem Lett 15:3886-90 (2005)  
Target
Name:
Caspase-8
Synonyms:
Apoptotic cysteine protease CAP4 CASP8 Caspase Caspase-8 subunit p18 FADD-like ICE ICE-like apoptotic protease 5 MCH5 | MORT1-associated CED-3 homolog
Type:
Enzyme
Mol. Mass.:
55373.89
Organism:
Homo sapiens (Human)
Description:
Q14790
Residue:
479
  
Inhibitor
Name:
BDBM10556
Synonyms:
(3S)-5-(benzylsulfanyl)-3-[(2S)-2-[2-hydroxy-2-(5-iodo-2-methoxyphenyl)acetamido]-3-methylbutanamido]-4-oxopentanoic acid | valine aspartyl ketone 35
Type:
Small organic molecule
Emp. Form.:
C26H31IN2O7S
Mol. Mass.:
642.503
SMILES:
COc1ccc(I)cc1C(O)C(=O)N[C@@H](C(C)C)C(=O)N[C@@H](CC(O)=O)C(=O)CSCc1ccccc1
:
Substrate
Name:
Caspase-8 Fluorogenic Substrate
Synonyms:
Ac-IETD-AMC
Type:
Peptide
Mol. Mass.:
1673.49
Organism:
Description:
AMC=7-Amino-4-methylcoumarin
Residue:
16
ACILEGLTHRASPAMC