Target
Cholinesterase
Ligand
BDBM10625
Substrate
BDBM8978
Meas. Tech.
Cholinesterase Inhibition Assay
IC50
980±n/a nM
Citation
 Luo, WYu, QSKulkarni, SSParrish, DAHolloway, HWTweedie, DShafferman, ALahiri, DKBrossi, AGreig, NH Inhibition of human acetyl- and butyrylcholinesterase by novel carbamates of (-)- and (+)-tetrahydrofurobenzofuran and methanobenzodioxepine. J Med Chem 49:2174-85 (2006)  
Target
Name:
Cholinesterase
Synonyms:
Acylcholine acylhydrolase Butyrylcholine esterase (BChE) Butyrylcholinesterase (BuChE) CHLE_HUMAN Cholinesterases Pseudocholinesterase
Type:
Homotetramer
Mol. Mass.:
68422.27
Organism:
Homo sapiens (Human)
Description:
P06276
Residue:
602
  
Inhibitor
Name:
BDBM10625
Synonyms:
({[bis(propan-2-ylamino)phosphoryl]oxy}(propan-2-ylamino)phosphoryl)(propan-2-yl)amine iso-OMPA | tetra(monoisopropyl)pyrophosphortetramide
Type:
Small organic molecule
Emp. Form.:
C12H32N4O3P2
Mol. Mass.:
342.355
SMILES:
CC(C)NP(=O)(NC(C)C)OP(=O)(NC(C)C)NC(C)C
:
Substrate
Name:
BDBM8978
Synonyms:
(Propylcarbonylthioethyl)trimethylammonium iodide CHEMBL148530 butyrylthiocholine | butyrylthiocholine chloride
Type:
Small organic molecule
Emp. Form.:
C9H20NOS
Mol. Mass.:
190.326
SMILES:
CCCC(=O)SCC[N+](C)(C)C
: