Target
Proto-oncogene tyrosine-protein kinase receptor Ret [658-1114,V804M]
Ligand
BDBM305731
Substrate
Meas. Tech.
A RET Enzyme Assay
IC50
152±n/a nM
Citation
 Andrews, SWAronow, SBlake, JFBrandhuber, BJCollier, JCook, AHaas, JJiang, YKolakowski, GRMcFaddin, EAMcKenney, MLMcNulty, OTMetcalf, ATMoreno, DARamann, GATang, TPRen, LWalls, SM Substituted pyrazolo[1,5-A]pyridine compounds as RET kinase inhibitors US Patent  US10172845 Publication Date 1/8/2019 
Target
Name:
Proto-oncogene tyrosine-protein kinase receptor Ret [658-1114,V804M]
Synonyms:
CDHF12 PTC Proto-oncogene tyrosine-protein kinase receptor Ret (V804M) RET Kinase (V804M) (aa658-end) RET_HUMAN
Type:
Enzyme Catalytic Domain
Mol. Mass.:
51567.23
Organism:
Homo sapiens (Human)
Description:
P07949[658-1114,V804M]
Residue:
457
  
Inhibitor
Name:
BDBM305731
Synonyms:
6-(2-hydroxy-2- methylpropoxy)-4-(6-(4- hydroxy-4-(2- methylbenzyl)piperidin- 1-yl)pyridin-3-yl) pyrazolo[1,5-a]pyridine- 3-carbonitrile US10172845, Example 749 US10881652, Example 749 | US11648243, Example 749
Type:
Small organic molecule
Emp. Form.:
C30H33N5O3
Mol. Mass.:
511.6147
SMILES:
Cc1ccccc1CC1(O)CCN(CC1)c1ccc(cn1)-c1cc(OCC(C)(C)O)cn2ncc(C#N)c12
: