Target
Tyrosine-protein kinase JAK3
Ligand
BDBM316515
Substrate
Meas. Tech.
JAK Caliper Enzyme Assay
IC50
22.0±n/a nM
Citation
 Thorarensen, ABrown, MFCasimiro-Garcia, AChe, YCoe, JWFlanagan, MEGilbert, AMHayward, MMLangille, JDMontgomery, JITelliez, JUnwalla, RJTrujillo, JI Pyrrolo[2,3-d]pyrimidinyl, pyrrolo[2,3-b]pyrazinyl and pyrrolo[2,3-d]pyridinyl acrylamides US Patent  US9617258 Publication Date 4/11/2017 
Target
Name:
Tyrosine-protein kinase JAK3
Synonyms:
JAK-3 JAK3_HUMAN Janus kinase 3 (JAK3) L-JAK | Leukocyte janus kinase
Type:
Protein
Mol. Mass.:
125111.08
Organism:
Homo sapiens (Human)
Description:
P52333
Residue:
1124
  
Inhibitor
Name:
BDBM316515
Synonyms:
US11111242, Example 3 | US9617258, Example 3
Type:
Small organic molecule
Emp. Form.:
C14H16ClN5O
Mol. Mass.:
305.763
SMILES:
Clc1c[nH]c2ncnc(N[C@@H]3CCCN(C3)C(=O)C=C)c12
: