Target
Amine oxidase [flavin-containing] B
Ligand
BDBM11016
Substrate
BDBM10990
Meas. Tech.
MAO Inhibition Assay
pH
7.4±n/a
Temperature
311.15±n/a K
Ki
2400±10 nM
Citation
 Chimenti, FMaccioni, ESecci, DBolasco, AChimenti, PGranese, ABefani, OTurini, PAlcaro, SOrtuso, FCirilli, RLa Torre, FCardia, MCDistinto, S Synthesis, molecular modeling studies, and selective inhibitory activity against monoamine oxidase of 1-thiocarbamoyl-3,5-diaryl-4,5-dihydro-(1H)- pyrazole derivatives. J Med Chem 48:7113-22 (2005)  
Target
Name:
Amine oxidase [flavin-containing] B
Synonyms:
AOFB_BOVIN MAO-B Monoamine Oxidase Type B (MAO-B) Monoamine oxidase B | Monoamine oxidase type B
Type:
PROTEIN
Mol. Mass.:
58428.94
Organism:
Bos taurus
Description:
ChEMBL_1501478
Residue:
520
  
Inhibitor
Name:
BDBM11016
Synonyms:
(-)-(S)4 1-thiocarbamoyl-3,5-diaryl-4,5-dihydro-(1H)-pyrazole deriv. 4S
Type:
Small organic molecule
Emp. Form.:
C16H13ClFN3S
Mol. Mass.:
333.811
SMILES:
NC(=S)N1N=C(C[C@H]1c1ccc(Cl)cc1)c1ccc(F)cc1
:
Substrate
Name:
BDBM10990
Synonyms:
3-amino-1-(2-aminophenyl)propan-1-one Kynuramine
Type:
Small organic molecule
Emp. Form.:
C9H12N2O
Mol. Mass.:
164.2044
SMILES:
NCCC(=O)c1ccccc1N
: