Target
Cytochrome P450 2C8
Ligand
BDBM211836
Substrate
Meas. Tech.
Human Neutrophil Elastase Assay
pH
7.5±n/a
Temperature
298.15±n/a K
IC50
>50000±n/a nM
Comments
extracted
Citation
 Gnamm, COost, TPeters, SHoesch, HRies, UJ Substituted bicyclic dihydropyrimidinones and their use as inhibitors of neutrophil elastase activity US Patent  US9670166 Publication Date 6/6/2017 
Target
Name:
Cytochrome P450 2C8
Synonyms:
CP2C8_HUMAN CYPIIC8 P450 IIC2 P450 form 1 | S-mephenytoin 4-hydroxylase
Type:
Protein
Mol. Mass.:
55839.23
Organism:
Homo sapiens (Human)
Description:
P10632
Residue:
490
  
Inhibitor
Name:
BDBM211836
Synonyms:
US9290459, 41A | US9670166, 41A
Type:
Small organic molecule
Emp. Form.:
C26H23F3N4O4
Mol. Mass.:
512.4804
SMILES:
CC(C)(O)CNC(=O)N1[C@@H](C2=C(CCC2=O)N(C1=O)c1cccc(c1)C(F)(F)F)c1ccc(cc1)C#N
: