Target
Solute carrier family 22 member 12
Ligand
BDBM318954
Substrate
Meas. Tech.
HEK-URAT1 assay
IC50
21.0±n/a nM
Citation
 Endo, TKobayashi, KTanaka, HSaito, DHirano, MEndou, HAnzai, N URAT1 inhibitor US Patent  US10173990 Publication Date 1/8/2019 
Target
Name:
Solute carrier family 22 member 12
Synonyms:
OATL4 RST S22AC_HUMAN Solute carrier family 22 member 12 URAT1 Urate anion exchanger 1 (URAT1) | Uric Acid Transporter 1 (URAT1)
Type:
Enzyme
Mol. Mass.:
59638.65
Organism:
Homo sapiens (Human)
Description:
Q96S37
Residue:
553
  
Inhibitor
Name:
BDBM318954
Synonyms:
2-[[7-(4-Cyanophenyl)benzo[d]isothiazol-6-yl]thio]-2-ethylbutanoic acid | US10173990, Example 113
Type:
Small organic molecule
Emp. Form.:
C20H18N2O2S2
Mol. Mass.:
382.499
SMILES:
CCC(CC)(Sc1ccc2cnsc2c1-c1ccc(cc1)C#N)C(O)=O
: