Target
Phosphatidylinositol 3-kinase regulatory subunit alpha/4,5-bisphosphate 3-kinase catalytic subunit beta isoform
Ligand
BDBM188117
Substrate
Meas. Tech.
PI3K (p110β/p85α) (h) [Non-Radioactive Assay]
Temperature
298.15±n/a K
IC50
168±n/a nM
Comments
extracted
Citation
 Xi, NWang, LWu, ZFeng, XWu, Y Substituted aminopyrimidine compounds and methods of use US Patent  US9670194 Publication Date 6/6/2017 
Target
Name:
Phosphatidylinositol 3-kinase regulatory subunit alpha/4,5-bisphosphate 3-kinase catalytic subunit beta isoform
Synonyms:
PI3-kinase subunit p110 beta/p85 alpha PI3K p110beta/p85alpha (Human) p110β/p85α | p110beta/p85alpha
Type:
Protein
Mol. Mass.:
Description:
Components:
This complex has 2 components.
Component 1
Name:
Phosphatidylinositol 4,5-bisphosphate 3-kinase catalytic subunit beta isoform
Synonyms:
PI3-kinase p110 subunit beta PI3Kbeta PIK3CB Phosphatidylinositol 4,5-bisphosphate 3-kinase catalytic subunit beta (PI3Kbeta) Phosphatidylinositol 4,5-bisphosphate 3-kinase catalytic subunit beta isoform (PI3K) Phosphatidylinositol 4,5-bisphosphate 3-kinase catalytic subunit beta isoform (PI3Kbeta) Phosphatidylinositol-4,5-bisphosphate 3-kinase catalytic subunit beta isoform Phosphoinositide 3-Kinase (PI3K), beta Chain A PtdIns-3-kinase p110
Type:
Enzyme Subunit
Mol. Mass.:
122769.00
Organism:
Homo sapiens (Human)
Description:
P42338
Residue:
1070
  
Component 2
Name:
Phosphatidylinositol 3-kinase regulatory subunit alpha
Synonyms:
GRB1 PI3-kinase class I PI3-kinase p85-alpha subunit PI3-kinase subunit p85-alpha PIK3CG/PIK3R1 Phosphatidylinositol 3-kinase 85 kDa regulatory subunit alpha (PI3K alpha) Phosphatidylinositol 3-kinase regulatory subunit alpha (PIK3R1) Phosphatidylinositol 3-kinase regulatory subunit alpha isoform 1 (PI3 Kinase alpha) Phosphatidylinositol 4,5-bisphosphate 3-kinase catalytic subunit alpha isoform (PI3Kalpha) PtdIns-3-kinase p85-alpha p85 alpha
Type:
Protein
Mol. Mass.:
83592.82
Organism:
Homo sapiens (Human)
Description:
P27986
Residue:
724
  
Inhibitor
Name:
BDBM188117
Synonyms:
US9670194, Ex. 2 (S)-2-(1-((6-amino-5-(5-methyl-1,3,4-oxadiazol-2-yl)pyrimidin-4-yl)amino)-propyl)-5-chloro-3-cyclopropylquinazolin-4(3H)-one
Type:
Small organic molecule
Emp. Form.:
C21H21ClN8O2
Mol. Mass.:
452.897
SMILES:
CC[C@H](Nc1ncnc(N)c1-c1nnc(C)o1)c1nc2cccc(Cl)c2c(=O)n1C1CC1
: