Target
Phosphatidylinositol 4,5-bisphosphate 3-kinase catalytic subunit beta/delta isoform
Ligand
BDBM189304
Substrate
Meas. Tech.
PI3K (p110α/p85α) (h) [Non-Radioactive Assay]
Temperature
298.15±n/a K
IC50
70±n/a nM
Comments
extracted
Citation
 Xi, NWang, LWu, ZFeng, XWu, Y Substituted aminopyrimidine compounds and methods of use US Patent  US9670194 Publication Date 6/6/2017 
Target
Name:
Phosphatidylinositol 4,5-bisphosphate 3-kinase catalytic subunit beta/delta isoform
Synonyms:
p110δ/p85α p110-delta/ p110-gamma | pi3k$#948
Type:
Protein
Mol. Mass.:
Description:
Components:
This complex has 2 components.
Component 1
Name:
Phosphatidylinositol 4,5-bisphosphate 3-kinase catalytic subunit delta isoform
Synonyms:
PI3-kinase p110 subunit delta PI3-kinase subunit p110-delta PIK3CD Phosphatidylinositol 4,5-biphosphate 3-kinase catalytic subunit delta (PIK3CD) Phosphatidylinositol 4,5-bisphosphate 3-kinase 110 kDa catalytic subunit delta (PI3K delta) Phosphatidylinositol 4,5-bisphosphate 3-kinase catalytic subunit delta (PI3Kdelta) Phosphatidylinositol 4,5-bisphosphate 3-kinase catalytic subunit delta isoform (PI3K delta) Phosphatidylinositol 4,5-bisphosphate 3-kinase catalytic subunit delta isoform (PI3K-delta) Phosphatidylinositol 4,5-bisphosphate 3-kinase catalytic subunit delta isoform (PI3Kdelta)
Type:
Enzyme Subunit
Mol. Mass.:
119489.41
Organism:
Homo sapiens (Human)
Description:
O00329
Residue:
1044
  
Component 2
Name:
Phosphatidylinositol 4,5-bisphosphate 3-kinase catalytic subunit beta isoform
Synonyms:
PI3-kinase p110 subunit beta PI3Kbeta PIK3CB Phosphatidylinositol 4,5-bisphosphate 3-kinase catalytic subunit beta (PI3Kbeta) Phosphatidylinositol 4,5-bisphosphate 3-kinase catalytic subunit beta isoform (PI3K) Phosphatidylinositol 4,5-bisphosphate 3-kinase catalytic subunit beta isoform (PI3Kbeta) Phosphatidylinositol-4,5-bisphosphate 3-kinase catalytic subunit beta isoform Phosphoinositide 3-Kinase (PI3K), beta Chain A PtdIns-3-kinase p110
Type:
Enzyme Subunit
Mol. Mass.:
122769.00
Organism:
Homo sapiens (Human)
Description:
P42338
Residue:
1070
  
Inhibitor
Name:
BDBM189304
Synonyms:
US9670194, Ex. 32 (S)-2-(1-((6-amino-5-(1-methyl-1H-1,2,4-triazol-3-yl)pyrimidin-4-yl)amino)-propyl)-5-chloro-3-phenylquinazolin-4(3H)-one
Type:
Small organic molecule
Emp. Form.:
C24H22ClN9O
Mol. Mass.:
487.944
SMILES:
CC[C@H](Nc1ncnc(N)c1-c1ncn(C)n1)c1nc2cccc(Cl)c2c(=O)n1-c1ccccc1
: