Target
Phosphatidylinositol 4,5-bisphosphate 3-kinase catalytic subunit gamma isoform
Ligand
BDBM189844
Substrate
Meas. Tech.
PI3K (p110α/p85α) (h) [Non-Radioactive Assay]
Temperature
298.15±n/a K
IC50
269±n/a nM
Comments
extracted
Citation
 Xi, NWang, LWu, ZFeng, XWu, Y Substituted aminopyrimidine compounds and methods of use US Patent  US9670194 Publication Date 6/6/2017 
Target
Name:
Phosphatidylinositol 4,5-bisphosphate 3-kinase catalytic subunit gamma isoform
Synonyms:
PI3-kinase p110 subunit gamma PI3Kgamma PK3CG_HUMAN Phosphatidylinositol 4,5-bisphosphate 3-kinase (PI3K) Phosphatidylinositol 4,5-bisphosphate 3-kinase catalytic subunit gamma (PI3Kgamma) Phosphatidylinositol 4,5-bisphosphate 3-kinase catalytic subunit gamma isoform (PI3K) Phosphatidylinositol-4,5-bisphosphate 3-kinase catalytic subunit gamma isoform Phosphoinositide 3-kinases gamma (PI3K gamma) p120-PI3K
Type:
Enzyme Subunit
Mol. Mass.:
126470.30
Organism:
Homo sapiens (Human)
Description:
P48736
Residue:
1102
  
Inhibitor
Name:
BDBM189844
Synonyms:
US9670194, Ex. 63 (S)-2-(1-((6-amino-5-(3-methyl-1,2,4-oxadiazol-5-yl)pyrimidin-4-yl)amino)ethyl)-5-fluoro-3-phenylquinazolin-4(3H)-one
Type:
Small organic molecule
Emp. Form.:
C23H19FN8O2
Mol. Mass.:
458.4478
SMILES:
C[C@H](Nc1ncnc(N)c1-c1nc(C)no1)c1nc2cccc(F)c2c(=O)n1-c1ccccc1
: