Target
Proto-oncogene tyrosine-protein kinase receptor Ret [V804M]
Ligand
BDBM284453
Substrate
Meas. Tech.
RET Enzyme Assay
IC50
47.3±n/a nM
Citation
 Andrews, SWBlake, JFChicarelli, MJGolos, AHaas, JJiang, YKolakowski, GR Substituted pyrazolo[1,5-a]pyridine compounds as RET kinase inhibitors US Patent  US10174027 Publication Date 1/8/2019 
Target
Name:
Proto-oncogene tyrosine-protein kinase receptor Ret [V804M]
Synonyms:
CDHF12 PTC RET RET51 ret enzyme (v804m)
Type:
Enzyme Catalytic Domain
Mol. Mass.:
124350.36
Organism:
Homo sapiens (Human)
Description:
P07949[V804M]
Residue:
1114
  
Inhibitor
Name:
BDBM284453
Synonyms:
4-(6-(4-((3- methoxypyridin-2- yl)methyl)piperazin-1- yl)pyridin-3-yl)-6-(1- methyl-1H-pyrazol-4- yl)pyrazolo[1,5-a]pyridine- 3-carbonitrile formate US10174027, Example 463
Type:
Small organic molecule
Emp. Form.:
C28H27N9O
Mol. Mass.:
505.5737
SMILES:
COc1cccnc1CN1CCN(CC1)c1ccc(cn1)-c1cc(cn2ncc(C#N)c12)-c1cnn(C)c1
: