Target
Proto-oncogene tyrosine-protein kinase receptor Ret [V804M]
Ligand
BDBM284120
Substrate
Meas. Tech.
RET Enzyme Assay
IC50
153±n/a nM
Citation
 Andrews, SWBlake, JFChicarelli, MJGolos, AHaas, JJiang, YKolakowski, GR Substituted pyrazolo[1,5-A]pyridine compounds as RET kinase inhibitors US Patent  US10174028 Publication Date 1/8/2019 
Target
Name:
Proto-oncogene tyrosine-protein kinase receptor Ret [V804M]
Synonyms:
CDHF12 PTC RET RET51 ret enzyme (v804m)
Type:
Enzyme Catalytic Domain
Mol. Mass.:
124350.36
Organism:
Homo sapiens (Human)
Description:
P07949[V804M]
Residue:
1114
  
Inhibitor
Name:
BDBM284120
Synonyms:
US10023570, Example 130 | US10174027, Example 130
Type:
Small organic molecule
Emp. Form.:
C26H29N9O2
Mol. Mass.:
499.5676
SMILES:
COCCN(C)C(=O)N1CCN(CC1)c1ccc(cn1)-c1cc(cn2ncc(C#N)c12)-c1cnn(C)c1
: