Target
Bile acid receptor
Ligand
BDBM322142
Substrate
Meas. Tech.
TR-FRET Farnesoid X Receptor Coactivator Assay
EC50
6.00±n/a nM
Citation
 Wang, XYang, XPan, SGuo, RWu, JZhang, YCheng, C Tricyclic compounds and uses thereof in medicine US Patent  US10183917 Publication Date 1/22/2019 
Target
Name:
Bile acid receptor
Synonyms:
BAR FXR HRR1 NR1H4_HUMAN RIP14 Retinoid X receptor-interacting protein 14 | farnesoid x receptor
Type:
Nuclear Receptor
Mol. Mass.:
55916.24
Organism:
Homo sapiens (Human)
Description:
Q96RI1
Residue:
486
  
Inhibitor
Name:
BDBM322142
Synonyms:
US10183917, Example 5
Type:
Small organic molecule
Emp. Form.:
C27H19Cl2NO7S
Mol. Mass.:
572.413
SMILES:
OC(=O)c1ccc2CS(=O)(=O)c3cc(OCc4c(onc4-c4c(Cl)cccc4Cl)C4CC4)ccc3Oc2c1
: