Target
Neuronal acetylcholine receptor subunit alpha-7
Ligand
BDBM322472
Substrate
Meas. Tech.
Human alpha7 nAChR Binding Assay
Ki
>30000±n/a nM
Citation
 Acharya, RBurnett, DABursavich, MGCook, ASHarrison, BAKoenig, GMcriner, AJ Geminal substituted quinuclidine amide compounds as agonists of α-7 nicotonic acetylcholine receptors US Patent  US10183938 Publication Date 1/22/2019 
Target
Name:
Neuronal acetylcholine receptor subunit alpha-7
Synonyms:
ACHA7_HUMAN Cholinergic, Nicotinic Alpha7 Neuronal acetylcholine receptor protein alpha-7 subunit Nicotinic acetylcholine receptor alpha-7 (alpha7 nAChR)
Type:
Mol. Mass.:
56448.33
Organism:
Homo sapiens (Human)
Description:
CHRNA7 (NACHRA7)
Residue:
502
  
Inhibitor
Name:
BDBM322472
Synonyms:
(R)-N-(2,2-dimethylquinuclidin-3-yl)imidazo[1,2-a]pyrazine-6-carboxamide | US10183938, Compound (R)-225
Type:
Small organic molecule
Emp. Form.:
C16H21N5O
Mol. Mass.:
299.3708
SMILES:
CC1(C)[C@H](NC(=O)c2cn3ccnc3cn2)C2CCN1CC2
: