Target
Carbonic anhydrase 4
Ligand
BDBM11629
Substrate
BDBM10856
Meas. Tech.
CA Inhibition Assay
Ki
2.0±n/a nM
Citation
 Ilies, MAVullo, DPastorek, JScozzafava, AIlies, MCaproiu, MTPastorekova, SSupuran, CT Carbonic anhydrase inhibitors. Inhibition of tumor-associated isozyme IX by halogenosulfanilamide and halogenophenylaminobenzolamide derivatives. J Med Chem 46:2187-96 (2003)  
Target
Name:
Carbonic anhydrase 4
Synonyms:
CA-IV CAH4_BOVIN Carbonic Anhydrase IV Carbonic anhydrase 4
Type:
Enzyme
Mol. Mass.:
35152.74
Organism:
Bos taurus (bovine)
Description:
Bovine isozyme, isolated from lung microsomes
Residue:
312
  
Inhibitor
Name:
BDBM11629
Synonyms:
2-N-(4-amino-3-bromo-5-chlorobenzene)-1,3,4-thiadiazole-2,5-disulfonamide aminobenzolamide 22
Type:
Small organic molecule
Emp. Form.:
C8H7BrClN5O4S3
Mol. Mass.:
448.724
SMILES:
Nc1c(Cl)cc(cc1Br)S(=O)(=O)Nc1nnc(s1)S(N)(=O)=O
:
Substrate
Name:
BDBM10856
Synonyms:
Carbon Dioxide | methanedione
Type:
Small organic molecule
Emp. Form.:
CO2
Mol. Mass.:
44.0095
SMILES:
O=C=O
: