Target
Ectonucleotide pyrophosphatase/phosphodiesterase family member 2
Ligand
BDBM193006
Substrate
Meas. Tech.
Human ENPP2 (hENPP2) Assay
pH
8.5±n/a
Temperature
298.15±n/a K
IC50
>1000±n/a nM
Comments
extracted
Citation
 Desroy, NHeckmann, BBrys, RCJoncour, AMPeixoto, CBock, XM Compounds and pharmaceutical compositions thereof for the treatment of inflammatory disorders US Patent  US9670204 Publication Date 6/6/2017 
Target
Name:
Ectonucleotide pyrophosphatase/phosphodiesterase family member 2
Synonyms:
ATX Autotaxin (ATX) ENPP2 Ectonucleotide Pyrophosphatase/Phosphodiesterase 2 (ENPP2) Extracellular lysophospholipase D PDNP2
Type:
Enzyme
Mol. Mass.:
99007.13
Organism:
Homo sapiens (Human)
Description:
Q13822
Residue:
863
  
Inhibitor
Name:
BDBM193006
Synonyms:
US10526329, Compound 186 US9670204, 186 2-(2-((2-ethyl-6-(1-(methylsulfonyl)piperidin-4-yl)imidazo[1,2-a]pyridin-3-yl)(methyl)amino)-4-(4-fluorophenyl)thiazol-5-yl)acetonitrile
Type:
Small organic molecule
Emp. Form.:
C27H29FN6O2S2
Mol. Mass.:
552.687
SMILES:
CCc1nc2ccc(cn2c1N(C)c1nc(c(CC#N)s1)-c1ccc(F)cc1)C1CCN(CC1)S(C)(=O)=O
: