Target
Carbonic anhydrase 2
Ligand
BDBM11640
Substrate
BDBM10856
Meas. Tech.
CA Inhibition Assay
pH
7.5±n/a
Temperature
295.15±n/a K
Ki
19±n/a nM
Citation
 Menchise, VDe Simone, GAlterio, VDi Fiore, APedone, CScozzafava, ASupuran, CT Carbonic anhydrase inhibitors: stacking with Phe131 determines active site binding region of inhibitors as exemplified by the X-ray crystal structure of a membrane-impermeant antitumor sulfonamide complexed with isozyme II. J Med Chem 48:5721-7 (2005)  
Target
Name:
Carbonic anhydrase 2
Synonyms:
CA-II CAC Carbonate dehydratase II Carbonic anhydrase 2 (CA-II) Carbonic anhydrase C Carbonic anhydrase II (CA-II) Carbonic anhydrase II (hCA II) | Carbonic anhydrase isoenzyme II (hCA II)
Type:
Enzyme
Mol. Mass.:
29250.71
Organism:
Homo sapiens (Human)
Description:
P00918
Residue:
260
  
Inhibitor
Name:
BDBM11640
Synonyms:
3-[(2,3,4,5,6-pentafluorophenyl)amino]-1-(4-sulfamoylphenyl)thiourea Compound 9 | fluorine-containing thiourea 9
Type:
Small organic molecule
Emp. Form.:
C13H9F5N4O2S2
Mol. Mass.:
412.358
SMILES:
NS(=O)(=O)c1ccc(NC(=S)NNc2c(F)c(F)c(F)c(F)c2F)cc1
:
Substrate
Name:
BDBM10856
Synonyms:
Carbon Dioxide | methanedione
Type:
Small organic molecule
Emp. Form.:
CO2
Mol. Mass.:
44.0095
SMILES:
O=C=O
: