Target
Carbonic anhydrase 9
Ligand
BDBM11639
Substrate
BDBM10856
Meas. Tech.
CA Inhibition Assay
pH
7.5±n/a
Temperature
295.15±n/a K
Ki
16±n/a nM
Citation
 Menchise, VDe Simone, GAlterio, VDi Fiore, APedone, CScozzafava, ASupuran, CT Carbonic anhydrase inhibitors: stacking with Phe131 determines active site binding region of inhibitors as exemplified by the X-ray crystal structure of a membrane-impermeant antitumor sulfonamide complexed with isozyme II. J Med Chem 48:5721-7 (2005)  
Target
Name:
Carbonic anhydrase 9
Synonyms:
CA-IX CAH9_HUMAN Carbonic anhydrase 9 (CA IX) Carbonic anhydrase 9 precursor Carbonic anhydrase IX (CAIX) Carbonic anhydrases; II & IX MN RCC-associated antigen G250
Type:
Enzyme
Mol. Mass.:
49669.03
Organism:
Homo sapiens (Human)
Description:
Catalytic domain of human cloned isozyme was used in the assay
Residue:
459
  
Inhibitor
Name:
BDBM11639
Synonyms:
4-[5-(4-methylphenyl)-3-(trifluoromethyl)-1H-pyrazol-1-yl]benzene-1-sulfonamide CLX Celecoxib US11478464, Compound Celecoxib US8741944, Comparative Compound cid_2662
Type:
Small organic molecule
Emp. Form.:
C17H14F3N3O2S
Mol. Mass.:
381.372
SMILES:
Cc1ccc(cc1)-c1cc(nn1-c1ccc(cc1)S(N)(=O)=O)C(F)(F)F
:
Substrate
Name:
BDBM10856
Synonyms:
Carbon Dioxide | methanedione
Type:
Small organic molecule
Emp. Form.:
CO2
Mol. Mass.:
44.0095
SMILES:
O=C=O
: