Target
Phosphatidylinositol 4,5-bisphosphate 3-kinase catalytic subunit gamma isoform
Ligand
BDBM326261
Substrate
Meas. Tech.
Inhibition Assay
IC50
0.700±n/a nM
Citation
 Ruan, F Heterocyclic compounds as inhibitors of class I PI3KS US Patent  US9637488 Publication Date 5/2/2017 
Target
Name:
Phosphatidylinositol 4,5-bisphosphate 3-kinase catalytic subunit gamma isoform
Synonyms:
PI3-kinase p110 subunit gamma PI3Kgamma PK3CG_HUMAN Phosphatidylinositol 4,5-bisphosphate 3-kinase (PI3K) Phosphatidylinositol 4,5-bisphosphate 3-kinase catalytic subunit gamma (PI3Kgamma) Phosphatidylinositol 4,5-bisphosphate 3-kinase catalytic subunit gamma isoform (PI3K) Phosphatidylinositol-4,5-bisphosphate 3-kinase catalytic subunit gamma isoform Phosphoinositide 3-kinases gamma (PI3K gamma) p120-PI3K
Type:
Enzyme Subunit
Mol. Mass.:
126470.30
Organism:
Homo sapiens (Human)
Description:
P48736
Residue:
1102
  
Inhibitor
Name:
BDBM326261
Synonyms:
US9637488, 21
Type:
Small organic molecule
Emp. Form.:
C24H19FN6
Mol. Mass.:
410.4463
SMILES:
Fc1ccc2cc(C3CCCN3c3ncnc4[nH]cnc34)c(nc2c1)-c1ccccc1
: