Target
Orexin/Hypocretin receptor type 1
Ligand
BDBM164137
Substrate
Meas. Tech.
Rat and Human Orexin 1 Receptor Radioligand Binding Assay
Ki
61.0±n/a nM
Citation
 Coate, HRDvorak, CAFitzgerald, AELebold, TPPreville, CShireman, BT Substituted 7-azabicycles and their use as orexin receptor modulators US Patent  US9637496 Publication Date 5/2/2017 
Target
Name:
Orexin/Hypocretin receptor type 1
Synonyms:
HCRTR1 OX1R_HUMAN Orexin receptor type 1 (OR 1) Orexin receptor type 1 (OX1) Orexin receptor type 1 (OxR1) | Ox1r
Type:
Protein
Mol. Mass.:
47554.50
Organism:
Homo sapiens (Human)
Description:
O43613
Residue:
425
  
Inhibitor
Name:
BDBM164137
Synonyms:
US9062078, 267 US9637496, 267 | US9695183, 267
Type:
Small organic molecule
Emp. Form.:
C22H18F4N6O
Mol. Mass.:
458.4115
SMILES:
Fc1ccc(C(=O)N2C3CCC2C(C3)Nc2cnc(cn2)C(F)(F)F)c(c1)-c1ncccn1
: