Target
Sphingosine 1-phosphate receptor 5
Ligand
BDBM329368
Substrate
Meas. Tech.
In Vitro Binding Assay
IC50
2.20±n/a nM
Citation
 Swenson, RE Sphingosine 1-phosphate receptor antagonists US Patent  US9663511 Publication Date 5/30/2017 
Target
Name:
Sphingosine 1-phosphate receptor 5
Synonyms:
EDG8 S1P5 S1PR5_HUMAN Sphingosine 1-phosphate receptor Edg-8
Type:
G Protein-Coupled Receptor (GPCR)
Mol. Mass.:
41796.42
Organism:
Homo sapiens (Human)
Description:
Residue:
398
  
Inhibitor
Name:
BDBM329368
Synonyms:
US9663511, Compound 1. | US9663511, Compound 27.
Type:
Small organic molecule
Emp. Form.:
C19H21Cl2N7O
Mol. Mass.:
434.322
SMILES:
CC(C)c1cc(NNC(=O)Nc2cc(Cl)nc(Cl)c2)nc2n(CC=C)nc(C)c12
: