Target
Dipeptidyl peptidase 4
Ligand
BDBM11967
Substrate
BDBM11057
Meas. Tech.
Dipeptidyl Peptidase Inhibition Assay
IC50
260±n/a nM
Citation
 Ashton, WTSisco, RMDong, HLyons, KAHe, HDoss, GALeiting, BPatel, RAWu, JKMarsilio, FThornberry, NAWeber, AE Dipeptidyl peptidase IV inhibitors derived from beta-aminoacylpiperidines bearing a fused thiazole, oxazole, isoxazole, or pyrazole. Bioorg Med Chem Lett 15:2253-8 (2005)  
Target
Name:
Dipeptidyl peptidase 4
Synonyms:
ADABP Adenosine deaminase complexing protein 2 CD_antigen=CD26 DPP4 DPPIV Dipeptidyl peptidase 4 (DPP IV) Dipeptidyl peptidase 4 (DPP4) Dipeptidyl peptidase 4 membrane form Dipeptidyl peptidase IV Dipeptidyl peptidase IV (DDP-IV) Dipeptidyl peptidase IV membrane form Dipeptidyl peptidase-IV (DPP-4) T-cell activation antigen CD26 | TP103
Type:
Enzyme
Mol. Mass.:
88271.01
Organism:
Homo sapiens (Human)
Description:
P27487
Residue:
766
  
Inhibitor
Name:
BDBM11967
Synonyms:
(3R)-3-amino-4-(2,5-difluorophenyl)-1-{2-[4-(trifluoromethyl)phenyl]-4H,5H,6H,7H-pyrido[4,3-d][1,3]thiazol-5-yl}butan-1-one | thiazolopiperidine 69
Type:
Small organic molecule
Emp. Form.:
C23H20F5N3OS
Mol. Mass.:
481.481
SMILES:
N[C@@H](CC(=O)N1CCc2nc(sc2C1)-c1ccc(cc1)C(F)(F)F)Cc1cc(F)ccc1F
:
Substrate
Name:
BDBM11057
Synonyms:
1-(2-aminoacetyl)-N-(4-methyl-2-oxo-2H-chromen-7-yl)pyrrolidine-2-carboxamide hydrobromide Gly-Pro-7-amidomethylcoumarin | Gly-Pro-AMC
Type:
Small organic molecule
Emp. Form.:
C17H19N3O4
Mol. Mass.:
329.3505
SMILES:
Cc1cc(=O)oc2cc(NC(=O)C3CCCN3C(=O)CN)ccc12
: