Target
Dipeptidyl peptidase 8
Ligand
BDBM11964
Substrate
BDBM11561
Meas. Tech.
Dipeptidyl Peptidase Inhibition Assay
IC50
7100±n/a nM
Citation
 Ashton, WTSisco, RMDong, HLyons, KAHe, HDoss, GALeiting, BPatel, RAWu, JKMarsilio, FThornberry, NAWeber, AE Dipeptidyl peptidase IV inhibitors derived from beta-aminoacylpiperidines bearing a fused thiazole, oxazole, isoxazole, or pyrazole. Bioorg Med Chem Lett 15:2253-8 (2005)  
Target
Name:
Dipeptidyl peptidase 8
Synonyms:
DPP8 DPRP-1 Dipeptidyl peptidase 8 (DPP-8) Dipeptidyl peptidase 8/9 Dipeptidyl peptidase VIII Prolyl dipeptidase DPP8
Type:
Enzyme
Mol. Mass.:
103342.62
Organism:
Homo sapiens (Human)
Description:
Q6V1X1
Residue:
898
  
Inhibitor
Name:
BDBM11964
Synonyms:
(3R)-3-amino-4-(2,5-difluorophenyl)-1-{2-methyl-4H,5H,6H,7H-pyrido[4,3-d][1,3]thiazol-5-yl}butan-1-one | thiazolopiperidine 66
Type:
Small organic molecule
Emp. Form.:
C17H19F2N3OS
Mol. Mass.:
351.414
SMILES:
Cc1nc2CCN(Cc2s1)C(=O)C[C@H](N)Cc1cc(F)ccc1F
:
Substrate
Name:
BDBM11561
Synonyms:
1-(2-aminopropanoyl)-N-[2-oxo-4-(trifluoromethyl)-2H-chromen-7-yl]pyrrolidine-2-carboxamide | Ala-Pro-7-amido-4-trifluoromethylcoumarin
Type:
Small organic molecule
Emp. Form.:
C18H18F3N3O4
Mol. Mass.:
397.3484
SMILES:
CC(N)C(=O)N1CCCC1C(=O)Nc1ccc2c(cc(=O)oc2c1)C(F)(F)F
: