Target
Sigma non-opioid intracellular receptor 1
Ligand
BDBM50374602
Substrate
Meas. Tech.
Receptor Assay
Ki
6.55±0.25 nM
Citation
 McCurdy, CRMesangeau, CChin, FTJames, MLShen, BGambhir, SBiswal, SBehera, D Highly selective sigma receptor ligands and radioligands as probes in nociceptive processing and the pathphysiological study of memory deficits and cognitive disorders US Patent  US9724435 Publication Date 8/8/2017 
Target
Name:
Sigma non-opioid intracellular receptor 1
Synonyms:
Opioid receptor SGMR1_RAT Sigma non-opioid intracellular receptor 1 Sigma-1 | Sigmar1
Type:
Enzyme Catalytic Domain
Mol. Mass.:
25266.54
Organism:
RAT
Description:
Q9R0C9
Residue:
223
  
Inhibitor
Name:
BDBM50374602
Synonyms:
CHEMBL272608 US9724435, Compound SN-102
Type:
Small organic molecule
Emp. Form.:
C23H35N3OS
Mol. Mass.:
401.609
SMILES:
O=c1sc2ccccc2n1CCCCCCN1CCN(CC1)C1CCCCC1
: