Target
Bromodomain-containing protein 4 [1-477]/[333-460]/[44-168]/[44-460]
Ligand
BDBM331205
Substrate
Meas. Tech.
Time Resolved Fluorescence Resonance Energy Transfer (TR-FRET) Assay
IC50
<1±n/a nM
Citation
 Norris, DJVaccaro, WDeBenedetto, MVDegnan, APDelucca, GVDeskus, JAHan, WKumi, GKSchmitz, WDStarrett, Jr., JEHill, MDHuang, H Tricyclic compounds as anticancer agents US Patent  US9725449 Publication Date 8/8/2017 
Target
Name:
Bromodomain-containing protein 4 [1-477]/[333-460]/[44-168]/[44-460]
Synonyms:
Bromodomain BRD4
Type:
Protein
Mol. Mass.:
Description:
Components:
This complex has 4 components.
Component 1
Name:
Bromodomain-containing protein 4 [44-168]
Synonyms:
BET bromodomain 4(1) (BRD4(1)) BRD4-BD1 protein (aa 44-168) Bromodomain protein 4 (BRD4-BD1) Bromodomain-containing protein 4 (BRD4) (aa 44-168) Bromodomain-containing protein 4 bromodomain 1 (BRD4-BD1) | HUNK1
Type:
Enzyme Catalytic Domain
Mol. Mass.:
14866.49
Organism:
Homo sapiens (Human)
Description:
aa (44-168)
Residue:
125
  
Component 2
Name:
Bromodomain-containing protein 4 [333-460]
Synonyms:
BET bromodomain 4(2) (BRD4(2)) BRD4_HUMAN HUNK1
Type:
Enzyme Catalytic Domain
Mol. Mass.:
14818.38
Organism:
Homo sapiens (Human)
Description:
aa (333-460)
Residue:
128
  
Component 3
Name:
Bromodomain-containing protein 4 [1-477]
Synonyms:
BRD4 Bromodomain-containing protein 4 (BRD4 (aa 1-477) HUNK1
Type:
Enzyme Catalytic Domain
Mol. Mass.:
53061.90
Organism:
Homo sapiens (Human)
Description:
aa (1-477)
Residue:
477
  
Component 4
Name:
Bromodomain-containing protein 4 [44-460]
Synonyms:
BRD4 Bromodomain-containing protein 4 (BRD4) | HUNK1
Type:
Enzyme Catalytic Domain
Mol. Mass.:
47039.29
Organism:
Homo sapiens (Human)
Description:
aa (44-460)
Residue:
417
  
Inhibitor
Name:
BDBM331205
Synonyms:
10-Chloro-5-(dimethyl-1H-1,2,3-triazol-5-yl)-13-methoxy-8-[(S)-oxan-4-yl(phenyl)methyl]-3,8,11-triazatricyclo[7.4.0.02,7]trideca-1(13),2 US9725449, Example 40
Type:
Small organic molecule
Emp. Form.:
C27H27ClN6O2
Mol. Mass.:
502.995
SMILES:
COc1ncc(Cl)c2n([C@@H](C3CCOCC3)c3ccccc3)c3cc(cnc3c12)-c1c(C)nnn1C
: