Target
Cytochrome P450 2A6
Ligand
BDBM12350
Substrate
BDBM12342
Meas. Tech.
CYP2A6 Inhibition Assay
pH
7.5±n/a
Temperature
310.15±n/a K
Ki
67500±24000 nM
Citation
 Yano, JKDenton, TTCerny, MAZhang, XJohnson, EFCashman, JR Synthetic inhibitors of cytochrome P-450 2A6: inhibitory activity, difference spectra, mechanism of inhibition, and protein cocrystallization. J Med Chem 49:6987-7001 (2006)  
Target
Name:
Cytochrome P450 2A6
Synonyms:
1,4-cineole 2-exo-monooxygenase CP2A6_HUMAN CYP2A6 Coumarin 7-hydroxylase Cytochrome P450 IIA3 | Cytochrome P450(I)
Type:
Protein
Mol. Mass.:
56514.34
Organism:
Homo sapiens (Human)
Description:
P11509
Residue:
494
  
Inhibitor
Name:
BDBM12350
Synonyms:
CHEMBL180270 dimethyl[3-(pyridin-3-yl)prop-2-yn-1-yl]amine | nicotine 3-heteroaromatic analogue 3c
Type:
Small organic molecule
Emp. Form.:
C10H12N2
Mol. Mass.:
160.2157
SMILES:
CN(C)CC#Cc1cccnc1
:
Substrate
Name:
BDBM12342
Synonyms:
2H-chromen-2-one Coumarin
Type:
Natural product
Emp. Form.:
C9H6O2
Mol. Mass.:
146.1427
SMILES:
O=c1ccc2ccccc2o1
: