Target
Cytochrome P450 2A6
Ligand
BDBM12364
Substrate
BDBM12342
Meas. Tech.
CYP2A6 Inhibition Assay
Ki
600±n/a nM
Citation
 Yano, JKDenton, TTCerny, MAZhang, XJohnson, EFCashman, JR Synthetic inhibitors of cytochrome P-450 2A6: inhibitory activity, difference spectra, mechanism of inhibition, and protein cocrystallization. J Med Chem 49:6987-7001 (2006)  
Target
Name:
Cytochrome P450 2A6
Synonyms:
1,4-cineole 2-exo-monooxygenase CP2A6_HUMAN CYP2A6 Coumarin 7-hydroxylase Cytochrome P450 IIA3 | Cytochrome P450(I)
Type:
Protein
Mol. Mass.:
56514.34
Organism:
Homo sapiens (Human)
Description:
P11509
Residue:
494
  
Inhibitor
Name:
BDBM12364
Synonyms:
(5-Phenylthiophen-2-yl)methanamine | nicotine 3-heteroaromatic analogue 23
Type:
Small organic molecule
Emp. Form.:
C11H11NS
Mol. Mass.:
189.277
SMILES:
NCc1ccc(s1)-c1ccccc1
:
Substrate
Name:
BDBM12342
Synonyms:
2H-chromen-2-one Coumarin
Type:
Natural product
Emp. Form.:
C9H6O2
Mol. Mass.:
146.1427
SMILES:
O=c1ccc2ccccc2o1
: