Target
Cytochrome P450 2A6
Ligand
BDBM12371
Substrate
BDBM12342
Meas. Tech.
CYP2A6 Inhibition Assay
Ki
400±n/a nM
Citation
 Yano, JKDenton, TTCerny, MAZhang, XJohnson, EFCashman, JR Synthetic inhibitors of cytochrome P-450 2A6: inhibitory activity, difference spectra, mechanism of inhibition, and protein cocrystallization. J Med Chem 49:6987-7001 (2006)  
Target
Name:
Cytochrome P450 2A6
Synonyms:
1,4-cineole 2-exo-monooxygenase CP2A6_HUMAN CYP2A6 Coumarin 7-hydroxylase Cytochrome P450 IIA3 | Cytochrome P450(I)
Type:
Protein
Mol. Mass.:
56514.34
Organism:
Homo sapiens (Human)
Description:
P11509
Residue:
494
  
Inhibitor
Name:
BDBM12371
Synonyms:
(3-(Pyridin-3-yl)isoxazol-5-yl)methanamine Dihydrochloride [3-(pyridin-3-yl)-1,2-oxazol-5-yl]methanamine dihydrochloride | nicotine 3-heteroaromatic analogue 35
Type:
Small organic molecule
Emp. Form.:
C9H9N3O
Mol. Mass.:
175.1873
SMILES:
NCc1cc(no1)-c1cccnc1
:
Substrate
Name:
BDBM12342
Synonyms:
2H-chromen-2-one Coumarin
Type:
Natural product
Emp. Form.:
C9H6O2
Mol. Mass.:
146.1427
SMILES:
O=c1ccc2ccccc2o1
: