Target
Proto-oncogene tyrosine-protein kinase Src
Ligand
BDBM332698
Substrate
Meas. Tech.
In Vitro Biochemical Assay
Ki
36.0±n/a nM
Citation
 Soellner, MBPhadke, S Inhibitors of BCR-ABL mutants and use thereof US Patent  US10196378 Publication Date 2/5/2019 
Target
Name:
Proto-oncogene tyrosine-protein kinase Src
Synonyms:
Calmodulin/Proto-oncogene tyrosine-protein kinase Src Proto-oncogene c-Src SRC SRC_HUMAN V-src sarcoma (Schmidt-Ruppin A-2) viral oncogene homolog (avian) p60-Src | pp60c-src
Type:
Protein
Mol. Mass.:
59838.60
Organism:
Homo sapiens (Human)
Description:
P12931
Residue:
536
  
Inhibitor
Name:
BDBM332698
Synonyms:
US10196378, Compound C01
Type:
Small organic molecule
Emp. Form.:
C27H29F3N6O3
Mol. Mass.:
542.5528
SMILES:
CNC(=O)c1cc(Oc2ccc(NC(=O)Nc3ccc(CN4CCN(C)CC4)c(c3)C(F)(F)F)cc2)ccn1
: