Target
Proto-oncogene tyrosine-protein kinase Src
Ligand
BDBM332699
Substrate
Meas. Tech.
In Vitro Biochemical Assay
Ki
28.0±n/a nM
Citation
 Soellner, MBPhadke, S Inhibitors of BCR-ABL mutants and use thereof US Patent  US10196378 Publication Date 2/5/2019 
Target
Name:
Proto-oncogene tyrosine-protein kinase Src
Synonyms:
Calmodulin/Proto-oncogene tyrosine-protein kinase Src Proto-oncogene c-Src SRC SRC_HUMAN V-src sarcoma (Schmidt-Ruppin A-2) viral oncogene homolog (avian) p60-Src | pp60c-src
Type:
Protein
Mol. Mass.:
59838.60
Organism:
Homo sapiens (Human)
Description:
P12931
Residue:
536
  
Inhibitor
Name:
BDBM332699
Synonyms:
US10196378, Compound C02
Type:
Small organic molecule
Emp. Form.:
C25H26F3N5O2
Mol. Mass.:
485.5014
SMILES:
CN1CCN(Cc2ccc(NC(=O)Nc3ccc(Oc4ccncc4)cc3)cc2C(F)(F)F)CC1
: