Target
Dipeptidyl peptidase 8
Ligand
BDBM12653
Substrate
BDBM11057
Meas. Tech.
DPP Inhibition Assay
pH
7.5±n/a
Temperature
295.15±n/a K
Ki
230±n/a nM
Comments
Result is from racemic analogues.
Citation
 Pei, ZLi, Xvon Geldern, TWMadar, DJLongenecker, KYong, HLubben, THStewart, KDZinker, BABackes, BJJudd, ASMulhern, MBallaron, SJStashko, MAMika, AKBeno, DWReinhart, GAFryer, RMPreusser, LCKempf-Grote, AJSham, HLTrevillyan, JM Discovery of ((4R,5S)-5-amino-4-(2,4,5- trifluorophenyl)cyclohex-1-enyl)-(3- (trifluoromethyl)-5,6-dihydro- [1,2,4]triazolo[4,3-a]pyrazin-7(8H)-yl)methanone (ABT-341), a highly potent, selective, orally efficacious, and safe dipeptidyl peptidase IV inhibitor for the treatment of type 2 diabetes. J Med Chem 49:6439-42 (2006)  
Target
Name:
Dipeptidyl peptidase 8
Synonyms:
DPP8 DPRP-1 Dipeptidyl peptidase 8 (DPP-8) Dipeptidyl peptidase 8/9 Dipeptidyl peptidase VIII Prolyl dipeptidase DPP8
Type:
Enzyme
Mol. Mass.:
103342.62
Organism:
Homo sapiens (Human)
Description:
Q6V1X1
Residue:
898
  
Inhibitor
Name:
BDBM12653
Synonyms:
(1S,6R)-3-{[(3-carbamoylphenyl)amino]methyl}-6-(2,4,5-trifluorophenyl)cyclohex-3-en-1-aminium; 2,2,2-trifluoroacetate | ABT-341 analogue 19
Type:
Small organic molecule
Emp. Form.:
C20H21F3N3O
Mol. Mass.:
376.3949
SMILES:
NC(=O)c1cccc(NCC2=CC[C@@H]([C@@H]([NH3+])C2)c2cc(F)c(F)cc2F)c1
:
Substrate
Name:
BDBM11057
Synonyms:
1-(2-aminoacetyl)-N-(4-methyl-2-oxo-2H-chromen-7-yl)pyrrolidine-2-carboxamide hydrobromide Gly-Pro-7-amidomethylcoumarin | Gly-Pro-AMC
Type:
Small organic molecule
Emp. Form.:
C17H19N3O4
Mol. Mass.:
329.3505
SMILES:
Cc1cc(=O)oc2cc(NC(=O)C3CCCN3C(=O)CN)ccc12
: