Target
Coagulation factor X
Ligand
BDBM12825
Substrate
BDBM12658
Meas. Tech.
Enzyme Assay and Determination of the Inhibition Constants.
Ki
65±n/a nM
Citation
 Qiao, JXCheng, XModi, DPRossi, KALuettgen, JMKnabb, RMJadhav, PKWexler, RR 5-Amidinobenzo[b]thiophenes as dual inhibitors of factors IXa and Xa. Bioorg Med Chem Lett 15:29-35 (2005)  
Target
Name:
Coagulation factor X
Synonyms:
Activated coagulation factor X (FXa) Coagulation factor X precursor F10 Factor X heavy chain Factor Xa Stuart-Prower factor
Type:
Enzyme
Mol. Mass.:
54726.60
Organism:
Homo sapiens (Human)
Description:
Residue:
488
  
Inhibitor
Name:
BDBM12825
Synonyms:
2,2,2-trifluoroacetic acid; 2-(5-carbamimidoyl-1-benzothiophen-3-yl)-N-[(1S,2R)-2-[(carbamoylmethyl)carbamoyl]cyclohexyl]-3-phenylpropanamide cis-racemic
Type:
Small organic molecule
Emp. Form.:
C27H31N5O3S
Mol. Mass.:
505.632
SMILES:
NC(=O)CNC(=O)[C@@H]1CCCC[C@@H]1NC(=O)C(Cc1ccccc1)c1csc2ccc(cc12)C(N)=N
:
Substrate
Name:
BDBM12658
Synonyms:
4-[({[(1S)-4-carbamimidamido-1-[(4-nitrophenyl)carbamoyl]butyl]carbamoyl}methyl)carbamoyl]-4-[(2S,3S)-3-methyl-2-(phenylformamido)pentanamido]butanoic acid hydrochloride Chromogenic Substrate S-2222 benzoyl-Ile-Glu-Gly-Arg-p-nitroanilide
Type:
Small organic molecule
Emp. Form.:
C32H43N9O9
Mol. Mass.:
697.7387
SMILES:
[#6]-[#6]-[#6@H](-[#6])-[#6@H](-[#7]-[#6](=O)-c1ccccc1)-[#6](=O)-[#7]-[#6@@H](-[#6]-[#6]-[#6](-[#8])=O)-[#6](=O)-[#7]-[#6]-[#6](=O)-[#7]-[#6@@H](-[#6]-[#6]-[#6]\[#7]=[#6](\[#7])-[#7])-[#6](=O)-[#7]-c1ccc(cc1)-[#7+](-[#8-])=O
: