Target
Coagulation factor IX
Ligand
BDBM12825
Substrate
BDBM12774
Meas. Tech.
Enzyme Assay and Determination of the Inhibition Constants.
Ki
280±n/a nM
Citation
 Qiao, JXCheng, XModi, DPRossi, KALuettgen, JMKnabb, RMJadhav, PKWexler, RR 5-Amidinobenzo[b]thiophenes as dual inhibitors of factors IXa and Xa. Bioorg Med Chem Lett 15:29-35 (2005)  
Target
Name:
Coagulation factor IX
Synonyms:
Christmas factor Coagulation factor IX/VIII Coagulation factor IXa heavy chain F9 Factor IX Factor IXa (fIXa) Plasma thromboplastin component
Type:
Enzyme
Mol. Mass.:
51768.83
Organism:
Homo sapiens (Human)
Description:
P00740
Residue:
461
  
Inhibitor
Name:
BDBM12825
Synonyms:
2,2,2-trifluoroacetic acid; 2-(5-carbamimidoyl-1-benzothiophen-3-yl)-N-[(1S,2R)-2-[(carbamoylmethyl)carbamoyl]cyclohexyl]-3-phenylpropanamide cis-racemic
Type:
Small organic molecule
Emp. Form.:
C27H31N5O3S
Mol. Mass.:
505.632
SMILES:
NC(=O)CNC(=O)[C@@H]1CCCC[C@@H]1NC(=O)C(Cc1ccccc1)c1csc2ccc(cc12)C(N)=N
:
Substrate
Name:
BDBM12774
Synonyms:
(2S)-5-carbamimidamido-2-{2-[(2R)-3-(4-hydroxycyclohexyl)-2-methanesulfonamidopropanamido]acetamido}-N-(4-nitrophenyl)pentanamide; acetic acid Factor IX Chromogenic Substrate Methylsulfonyl-D-hexahydrotyrosyl-glycyl-arginine-4-nitroanilide Spectrozyme tPA | tPA/Trypsin Substrate
Type:
Small organic molecule
Emp. Form.:
C24H38N8O8S
Mol. Mass.:
598.672
SMILES:
CS(=O)(=O)NC(CC1CCC(O)CC1)C(=O)NCC(=O)NC(CCC\[NH+]=C(\N)[NH-])C(=O)Nc1ccc(cc1)[N+]([O-])=O
: