Target
Carbonic anhydrase 2
Ligand
BDBM12941
Substrate
BDBM10856
Meas. Tech.
CA Inhibition Assay
Ki
7.3±n/a nM
Citation
 Wilkinson, BLBornaghi, LFHouston, TAInnocenti, ASupuran, CTPoulsen, SA A novel class of carbonic anhydrase inhibitors: glycoconjugate benzene sulfonamides prepared by "click-tailing". J Med Chem 49:6539-48 (2006)  
Target
Name:
Carbonic anhydrase 2
Synonyms:
CA-II CAC Carbonate dehydratase II Carbonic anhydrase 2 (CA-II) Carbonic anhydrase C Carbonic anhydrase II (CA-II) Carbonic anhydrase II (hCA II) | Carbonic anhydrase isoenzyme II (hCA II)
Type:
Enzyme
Mol. Mass.:
29250.71
Organism:
Homo sapiens (Human)
Description:
P00918
Residue:
260
  
Inhibitor
Name:
BDBM12941
Synonyms:
4-({[4-(Aminosulfonyl)benzoyl]oxy}methyl-1-(beta-D-maltosyl)-1H-1,2,3-triazole Glycoconjugate Benzene Sulfonamide 3ff | {1-[(2R,3R,4R,5S,6R)-3,4-dihydroxy-6-(hydroxymethyl)-5-{[(2R,3R,4S,5S,6R)-3,4,5-trihydroxy-6-(hydroxymethyl)oxan-2-yl]oxy}oxan-2-yl]-1H-1,2,3-triazol-4-yl}methyl 4-sulfamoylbenzoate
Type:
Small organic molecule
Emp. Form.:
C22H30N4O14S
Mol. Mass.:
606.557
SMILES:
NS(=O)(=O)c1ccc(cc1)C(=O)OCc1cn(nn1)[C@@H]1O[C@H](CO)[C@@H](O[C@H]2O[C@H](CO)[C@@H](O)[C@H](O)[C@H]2O)[C@H](O)[C@H]1O
:
Substrate
Name:
BDBM10856
Synonyms:
Carbon Dioxide | methanedione
Type:
Small organic molecule
Emp. Form.:
CO2
Mol. Mass.:
44.0095
SMILES:
O=C=O
: