Target
Carbonic anhydrase 9
Ligand
BDBM12941
Substrate
BDBM10856
Meas. Tech.
CA Inhibition Assay
Ki
39±n/a nM
Citation
 Wilkinson, BLBornaghi, LFHouston, TAInnocenti, ASupuran, CTPoulsen, SA A novel class of carbonic anhydrase inhibitors: glycoconjugate benzene sulfonamides prepared by "click-tailing". J Med Chem 49:6539-48 (2006)  
Target
Name:
Carbonic anhydrase 9
Synonyms:
CA-IX CAH9_HUMAN Carbonic anhydrase 9 (CA IX) Carbonic anhydrase 9 precursor Carbonic anhydrase IX (CAIX) Carbonic anhydrases; II & IX MN RCC-associated antigen G250
Type:
Enzyme
Mol. Mass.:
49669.03
Organism:
Homo sapiens (Human)
Description:
Catalytic domain of human cloned isozyme was used in the assay
Residue:
459
  
Inhibitor
Name:
BDBM12941
Synonyms:
4-({[4-(Aminosulfonyl)benzoyl]oxy}methyl-1-(beta-D-maltosyl)-1H-1,2,3-triazole Glycoconjugate Benzene Sulfonamide 3ff | {1-[(2R,3R,4R,5S,6R)-3,4-dihydroxy-6-(hydroxymethyl)-5-{[(2R,3R,4S,5S,6R)-3,4,5-trihydroxy-6-(hydroxymethyl)oxan-2-yl]oxy}oxan-2-yl]-1H-1,2,3-triazol-4-yl}methyl 4-sulfamoylbenzoate
Type:
Small organic molecule
Emp. Form.:
C22H30N4O14S
Mol. Mass.:
606.557
SMILES:
NS(=O)(=O)c1ccc(cc1)C(=O)OCc1cn(nn1)[C@@H]1O[C@H](CO)[C@@H](O[C@H]2O[C@H](CO)[C@@H](O)[C@H](O)[C@H]2O)[C@H](O)[C@H]1O
:
Substrate
Name:
BDBM10856
Synonyms:
Carbon Dioxide | methanedione
Type:
Small organic molecule
Emp. Form.:
CO2
Mol. Mass.:
44.0095
SMILES:
O=C=O
: