Target
Prostaglandin E synthase
Ligand
BDBM197608
Substrate
Meas. Tech.
Inhibition Assay
IC50
0.700±n/a nM
Citation
 Otsu, H Heterocyclic derivative and pharmaceutical drug US Patent  US9732066 Publication Date 8/15/2017 
Target
Name:
Prostaglandin E synthase
Synonyms:
MGST1L1 PGES PTGES Prostaglandin E synthase (PGES-1) Prostaglandin E synthase-1 (PGES-1) Prostaglandin E2 synthase-1 ( mPGES-1)
Type:
Protein
Mol. Mass.:
17112.22
Organism:
Homo sapiens (Human)
Description:
Residue:
152
  
Inhibitor
Name:
BDBM197608
Synonyms:
US9216968, 208 | US9732066, 208
Type:
Small organic molecule
Emp. Form.:
C25H19Cl3N4O2
Mol. Mass.:
513.803
SMILES:
Cc1c(Cl)cccc1NC(=O)c1cc(NC(=O)c2cc(Cl)ccc2Cl)cc2[nH]c(nc12)C1CC1
: