Target
Coagulation factor X
Ligand
BDBM7842
Substrate
BDBM12989
Meas. Tech.
Enzyme Inhibition Assay
pH
8.3±n/a
Temperature
298.15±n/a K
IC50
0.4±n/a nM
Citation
 Roehrig, SStraub, APohlmann, JLampe, TPernerstorfer, JSchlemmer, KHReinemer, PPerzborn, E Discovery of the novel antithrombotic agent 5-chloro-N-({(5S)-2-oxo-3-[4-(3-oxomorpholin-4-yl)phenyl]-1,3-oxazolidin-5-yl}methyl)thiophene-2-carboxamide (BAY 59-7939): an oral, direct factor Xa inhibitor. J Med Chem 48:5900-8 (2005)  
Target
Name:
Coagulation factor X
Synonyms:
Activated coagulation factor X (FXa) Coagulation factor X precursor F10 Factor X heavy chain Factor Xa Stuart-Prower factor
Type:
Enzyme
Mol. Mass.:
54726.60
Organism:
Homo sapiens (Human)
Description:
Residue:
488
  
Inhibitor
Name:
BDBM7842
Synonyms:
BAY 59-7939 Analog 17 | US8822458, 46
Type:
Emp. Form.:
C19H18BrN3O5S
Mol. Mass.:
480.332
SMILES:
Brc1ccc(s1)C(=O)NC[C@H]1CN(C(=O)O1)c1ccc(cc1)N1CCOCC1=O
:
Substrate
Name:
BDBM12989
Synonyms:
CH3OCO-D-CHA-Gly-Arg-pNA.AcOH acetic acid; methyl N-[(1R)-1-[({[(1S)-4-carbamimidamido-1-[(4-nitrophenyl)carbamoyl]butyl]carbamoyl}methyl)carbamoyl]-2-cyclohexylethyl]carbamate
Type:
Small organic molecule
Emp. Form.:
C25H38N8O7
Mol. Mass.:
562.6186
SMILES:
COC(=O)N[C@H](CC1CCCCC1)C(=O)NCC(=O)N[C@@H](CCC[NH+]=C(N)[NH-])C(=O)Nc1ccc(cc1)[N+]([O-])=O
: