Target
Stromelysin-1
Ligand
BDBM13092
Substrate
Substance P
Meas. Tech.
Enzyme Inhibition Assay
pH
7.5±n/a
Temperature
310.15±n/a K
Ki
336±n/a nM
Citation
 MacPherson, LJBayburt, EKCapparelli, MPCarroll, BJGoldstein, RJustice, MRZhu, LHu, SMelton, RAFryer, LGoldberg, RLDoughty, JRSpirito, SBlancuzzi, VWilson, DO'Byrne, EMGanu, VParker, DT Discovery of CGS 27023A, a non-peptidic, potent, and orally active stromelysin inhibitor that blocks cartilage degradation in rabbits. J Med Chem 40:2525-32 (1997)  
Target
Name:
Stromelysin-1
Synonyms:
MMP-3 MMP3_HUMAN Matrix metalloproteinase 3 Matrix metalloproteinase-3 (MMP-3) SL-1 Stromelysin 1 | Transin-1
Type:
Enzyme
Mol. Mass.:
53973.13
Organism:
Homo sapiens (Human)
Description:
P08254
Residue:
477
  
Inhibitor
Name:
BDBM13092
Synonyms:
CGS 27023A Analog 20 US20230357139, Compound E
Type:
Small organic molecule
Emp. Form.:
C15H24N2O5S
Mol. Mass.:
344.426
SMILES:
CC(C)CN(CC(=O)NO)S(=O)(=O)c1ccc(OC(C)C)cc1
:
Substrate
Name:
Substance P
Synonyms:
Type:
Peptide
Mol. Mass.:
3656.51
Organism:
Description:
Residue:
32