Target
Dipeptidyl peptidase 2
Ligand
BDBM13519
Substrate
BDBM11156
Meas. Tech.
Dipeptidyl Peptidase Inhibition Assay
IC50
59000±n/a nM
Citation
 Biftu, TFeng, DQian, XLiang, GBKieczykowski, GEiermann, GHe, HLeiting, BLyons, KPetrov, ASinha-Roy, RZhang, BScapin, GPatel, SGao, YDSingh, SWu, JZhang, XThornberry, NAWeber, AE (3R)-4-[(3R)-3-Amino-4-(2,4,5-trifluorophenyl)butanoyl]-3-(2,2,2-trifluoroethyl)-1,4-diazepan-2-one, a selective dipeptidyl peptidase IV inhibitor for the treatment of type 2 diabetes. Bioorg Med Chem Lett 17:49-52 (2007)  
Target
Name:
Dipeptidyl peptidase 2
Synonyms:
DAP II DPP2_HUMAN Dipeptidyl aminopeptidase II Dipeptidyl peptidase 2 (DPP2) Dipeptidyl peptidase II (DPP II) Dipeptidyl peptidase II and dipeptidyl peptidase IV (DPP2 and DPP4) carboxytripeptidase dipeptidyl(amino)peptidase II | dipeptidylarylamidase
Type:
Protein
Mol. Mass.:
54339.29
Organism:
Homo sapiens (Human)
Description:
Q9UHL4
Residue:
492
  
Inhibitor
Name:
BDBM13519
Synonyms:
(3R)-4-[(3R)-3-amino-4-(2,4,5-trifluorophenyl)butanoyl]-3-methyl-1,4-diazepan-2-one 1,4-diazepan-2-one 2b | Diazepanone Analog 18
Type:
Small organic molecule
Emp. Form.:
C16H20F3N3O2
Mol. Mass.:
343.3441
SMILES:
C[C@H]1N(CCCNC1=O)C(=O)C[C@H](N)Cc1cc(F)c(F)cc1F
:
Substrate
Name:
BDBM11156
Synonyms:
1-(2-aminohexanoyl)-N-(4-methyl-2-oxo-2H-chromen-7-yl)pyrrolidine-2-carboxamide Nle-Pro-AMC
Type:
Emp. Form.:
Mol. Mass.:
SMILES:
: