Target
Tyrosine-protein kinase receptor UFO
Ligand
BDBM336694
Substrate
Meas. Tech.
Kinase Assay
IC50
55±n/a nM
Citation
 Dandu, RRHudkins, RLJosef, KAProuty, CPTripathy, R Uracil derivatives as AXL and c-MET kinase inhibitors US Patent  US9745283 Publication Date 8/29/2017 
Target
Name:
Tyrosine-protein kinase receptor UFO
Synonyms:
AXL TEL/AXL UFO | UFO_HUMAN
Type:
Enzyme
Mol. Mass.:
98316.97
Organism:
Homo sapiens (Human)
Description:
P30530
Residue:
894
  
Inhibitor
Name:
BDBM336694
Synonyms:
US9745283, Example 123
Type:
Small organic molecule
Emp. Form.:
C24H22FN5O6
Mol. Mass.:
495.4598
SMILES:
CCn1c(=O)c(nn(C)c1=O)C(=O)Nc1ccc(Oc2ccnc3cc(OC)c(OC)cc23)c(F)c1
: