Target
Hepatocyte growth factor receptor
Ligand
BDBM336694
Substrate
Meas. Tech.
Kinase Assay
IC50
550±n/a nM
Citation
 Dandu, RRHudkins, RLJosef, KAProuty, CPTripathy, R Uracil derivatives as AXL and c-MET kinase inhibitors US Patent  US9745283 Publication Date 8/29/2017 
Target
Name:
Hepatocyte growth factor receptor
Synonyms:
Hepatocyte growth factor receptor Hepatocyte growth factor receptor (c-MET) MET Met proto-oncogene (hepatocyte growth factor receptor) Tyrosine-protein kinase Met (c-Met) c-Met kinase
Type:
Protein
Mol. Mass.:
155559.73
Organism:
Homo sapiens (Human)
Description:
P08581
Residue:
1390
  
Inhibitor
Name:
BDBM336694
Synonyms:
US9745283, Example 123
Type:
Small organic molecule
Emp. Form.:
C24H22FN5O6
Mol. Mass.:
495.4598
SMILES:
CCn1c(=O)c(nn(C)c1=O)C(=O)Nc1ccc(Oc2ccnc3cc(OC)c(OC)cc23)c(F)c1
: