Target
Coagulation factor X
Ligand
BDBM13676
Substrate
BDBM12500
Meas. Tech.
Factor Xa Inhibition Assay
Ki
600±n/a nM
Citation
 Matter, HWill, DWNazare, MSchreuder, HLaux, VWehner, V Structural requirements for factor Xa inhibition by 3-oxybenzamides with neutral P1 substituents: combining X-ray crystallography, 3D-QSAR, and tailored scoring functions. J Med Chem 48:3290-312 (2005)  
Target
Name:
Coagulation factor X
Synonyms:
Activated coagulation factor X (FXa) Coagulation factor X precursor F10 Factor X heavy chain Factor Xa Stuart-Prower factor
Type:
Enzyme
Mol. Mass.:
54726.60
Organism:
Homo sapiens (Human)
Description:
Residue:
488
  
Inhibitor
Name:
BDBM13676
Synonyms:
1-({3-[2-(2,4-dichlorophenyl)ethoxy]-4-methoxyphenyl}carbonyl)-4-(pyridin-4-ylmethyl)piperazine | 3-Oxybenzamide 62
Type:
Small organic molecule
Emp. Form.:
C26H27Cl2N3O3
Mol. Mass.:
500.417
SMILES:
COc1ccc(cc1OCCc1ccc(Cl)cc1Cl)C(=O)N1CCN(Cc2ccncc2)CC1
:
Substrate
Name:
BDBM12500
Synonyms:
Cbz-D-Arg-Gly-L-Arg-pNA N-a-Benzyloxycarbonyl-Darginyl-L-glycyl-L-arginine-pnitroaniline benzyl N-[(1R)-4-carbamimidamido-1-[({[(1S)-4-carbamimidamido-1-[(4-nitrophenyl)carbamoyl]butyl]carbamoyl}methyl)carbamoyl]butyl]carbamate
Type:
Small organic molecule
Emp. Form.:
C28H39N11O7
Mol. Mass.:
641.6788
SMILES:
[#7]\[#6](-[#7])=[#7]/[#6]-[#6]-[#6]-[#6@@H](-[#7]-[#6](=O)-[#8]-[#6]-c1ccccc1)-[#6](=O)-[#7]-[#6]-[#6](=O)-[#7]-[#6@@H](-[#6]-[#6]-[#6]-[#7+]=[#6](-[#7])-[#7-])-[#6](=O)-[#7]-c1ccc(cc1)-[#7+](-[#8-])=O
: